MM rev 7028 build fails

Help with using MiniMyth's build system

Moderator: Pablo

pleeke
Contributor
Posts: 203
Joined: Thu Jun 30, 2005 10:25 pm

MM rev 7028 build fails

Post by pleeke »

Pablo,


I'm trying to compile recent MM svn (7028) and am getting this error;

Code: Select all

make[3]: Entering directory `/home/pleeke/svnroot/minimyth/gar-minimyth/script/utils/squashfs'
make[3]: `../../lang/c/cookies/build.d/install' is up to date.
 ==> Building lib/libattr as a dependency
make[4]: Entering directory `/home/pleeke/svnroot/minimyth/gar-minimyth/script/lib/libattr'
[===== NOW BUILDING:	attr-2.4.44	=====]
install -d cookies/build.d
	[fetch] complete for attr.
 ==> Running checksum on attr-2.4.44.src.tar.gz
d132c119831c27350e10b9f885711adc  download/attr-2.4.44.src.tar.gz
file attr-2.4.44.src.tar.gz passes checksum test!
	[checksum] complete for attr.
install -d work/build.d
 ==> Extracting download/attr-2.4.44.src.tar.gz
	[extract] complete for attr.
	[patch] complete for attr.
make[5]: Entering directory `/home/pleeke/svnroot/minimyth/gar-minimyth/script/lib/libattr'
make[5]: `../../lang/c/cookies/build.d/install' is up to date.
make[5]: `../../devel/build-system-bins/cookies/build.d/install' is up to date.
make[5]: Leaving directory `/home/pleeke/svnroot/minimyth/gar-minimyth/script/lib/libattr'
autoreconf: Entering directory `.'
autoreconf: configure.in: not using Gettext
autoreconf: running: aclocal -I //home/pleeke/svnroot/minimyth/gar-minimyth/images/build/usr/share/aclocal -I m4 --force 
autoreconf: configure.in: tracing
autoreconf: running: libtoolize --copy --force
libtoolize: putting auxiliary files in AC_CONFIG_AUX_DIR, `.'.
libtoolize: copying file `./ltmain.sh'
libtoolize: putting macros in AC_CONFIG_MACRO_DIR, `m4'.
libtoolize: copying file `m4/libtool.m4'
libtoolize: copying file `m4/ltoptions.m4'
libtoolize: copying file `m4/ltsugar.m4'
libtoolize: copying file `m4/ltversion.m4'
libtoolize: copying file `m4/lt~obsolete.m4'
libtoolize: Consider adding `-I m4' to ACLOCAL_AMFLAGS in Makefile.am.
autoreconf: running: /home/pleeke/svnroot/minimyth/gar-minimyth/images/build/usr/bin/autoconf --include=//home/pleeke/svnroot/minimyth/gar-minimyth/images/build/usr/share/aclocal --include=m4 --force
autoreconf: running: /home/pleeke/svnroot/minimyth/gar-minimyth/images/build/usr/bin/autoheader --include=//home/pleeke/svnroot/minimyth/gar-minimyth/images/build/usr/share/aclocal --include=m4 --force
autoreconf: configure.in: not using Automake
autoreconf: Leaving directory `.'
 ==> Running configure in work/build.d/attr-2.4.44
checking build system type... x86_64-pc-linux-gnu
checking host system type... x86_64-pc-linux-gnu
checking how to print strings... printf
checking for x86_64-linux-gnu-gcc... gcc
checking whether the C compiler works... yes
checking for C compiler default output file name... a.out
checking for suffix of executables... 
checking whether we are cross compiling... no
checking for suffix of object files... o
checking whether we are using the GNU C compiler... yes
checking whether gcc accepts -g... yes
checking for gcc option to accept ISO C89... none needed
checking for a sed that does not truncate output... //home/pleeke/svnroot/minimyth/gar-minimyth/images/build/usr/bin/sed
checking for grep that handles long lines and -e... //home/pleeke/svnroot/minimyth/gar-minimyth/images/build/usr/bin/grep
checking for egrep... //home/pleeke/svnroot/minimyth/gar-minimyth/images/build/usr/bin/grep -E
checking for fgrep... //home/pleeke/svnroot/minimyth/gar-minimyth/images/build/usr/bin/grep -F
checking for ld used by gcc... ld
checking if the linker (ld) is GNU ld... yes
checking for BSD- or MS-compatible name lister (nm)... nm
checking the name lister (nm) interface... BSD nm
checking whether ln -s works... yes
checking the maximum length of command line arguments... 3458764513820540925
checking whether the shell understands some XSI constructs... yes
checking whether the shell understands "+="... yes
checking for ld option to reload object files... -r
checking for x86_64-linux-gnu-objdump... objdump
checking how to recognize dependent libraries... pass_all
checking for x86_64-linux-gnu-ar... ar
checking for x86_64-linux-gnu-strip... strip
checking for x86_64-linux-gnu-ranlib... ranlib
checking for gawk... gawk
checking command to parse nm output from gcc object... ok
checking how to run the C preprocessor... cpp
checking for ANSI C header files... yes
checking for sys/types.h... yes
checking for sys/stat.h... yes
checking for stdlib.h... yes
checking for string.h... yes
checking for memory.h... yes
checking for strings.h... yes
checking for inttypes.h... yes
checking for stdint.h... yes
checking for unistd.h... yes
checking for dlfcn.h... yes
checking for objdir... .libs
checking if gcc supports -fno-rtti -fno-exceptions... no
checking for gcc option to produce PIC... -fPIC -DPIC
checking if gcc PIC flag -fPIC -DPIC works... yes
checking if gcc static flag -static works... yes
checking if gcc supports -c -o file.o... yes
checking if gcc supports -c -o file.o... (cached) yes
checking whether the gcc linker (ld -m elf_x86_64) supports shared libraries... yes
checking whether -lc should be explicitly linked in... no
checking dynamic linker characteristics... GNU/Linux ld.so
checking how to hardcode library paths into programs... immediate
checking whether stripping libraries is possible... yes
checking if libtool supports shared libraries... yes
checking whether to build shared libraries... yes
checking whether to build static libraries... no
checking for x86_64-linux-gnu-gcc... (cached) gcc
checking whether we are using the GNU C compiler... (cached) yes
checking whether gcc accepts -g... (cached) yes
checking for gcc option to accept ISO C89... (cached) none needed
checking for x86_64-linux-gnu-gcc... (cached) gcc
checking whether we are using the GNU C compiler... (cached) yes
checking whether gcc accepts -g... (cached) yes
checking for gcc option to accept ISO C89... (cached) none needed
checking for gmake... (cached) //home/pleeke/svnroot/minimyth/gar-minimyth/images/build/usr/bin/make
checking for tar... /bin/tar
checking for gzip... /bin/gzip
checking for makedepend... /bin/true
checking for sort... /usr/bin/sort
checking whether ln -s works... yes
checking for rpm... no
checking for an ANSI C-conforming const... yes
checking for mode_t... yes
checking for working alloca.h... yes
checking for alloca... yes
configure: creating ./config.status
config.status: creating include/builddefs
config.status: creating include/config.h
config.status: executing libtool commands
	[configure] complete for attr.
 ==> Running make in work/build.d/attr-2.4.44
make[5]: Entering directory `/home/pleeke/svnroot/minimyth/gar-minimyth/script/lib/libattr/work/build.d/attr-2.4.44'
//home/pleeke/svnroot/minimyth/gar-minimyth/images/build/usr/bin/make include libmisc libattr attr getfattr setfattr examples test m4 man doc po debian build
make[6]: Entering directory `/home/pleeke/svnroot/minimyth/gar-minimyth/script/lib/libattr/work/build.d/attr-2.4.44'
//home/pleeke/svnroot/minimyth/gar-minimyth/images/build/usr/bin/make -C include
//home/pleeke/svnroot/minimyth/gar-minimyth/images/build/usr/bin/make -C libmisc
make[7]: Entering directory `/home/pleeke/svnroot/minimyth/gar-minimyth/script/lib/libattr/work/build.d/attr-2.4.44/include'
ln -s . attr
make[7]: Entering directory `/home/pleeke/svnroot/minimyth/gar-minimyth/script/lib/libattr/work/build.d/attr-2.4.44/libmisc'
/bin/sh ../libtool --mode=compile gcc -pipe -march=x86-64 -O2  -m64 -g -O2 -DDEBUG -funsigned-char -fno-strict-aliasing -Wall -DVERSION=\"2.4.44\" -DLOCALEDIR=\"/home/pleeke/svnroot/minimyth/gar-minimyth/images/build/usr/share/locale\" -DPACKAGE=\"attr\" -I./include -D_GNU_SOURCE -D_FILE_OFFSET_BITS=64  -g -O2 -DDEBUG -funsigned-char -fno-strict-aliasing -Wall -DVERSION=\"2.4.44\" -DLOCALEDIR=\"/home/pleeke/svnroot/minimyth/gar-minimyth/images/build/usr/share/locale\" -DPACKAGE=\"attr\" -I./include -D_GNU_SOURCE -D_FILE_OFFSET_BITS=64  -g -O2 -DDEBUG -funsigned-char -fno-strict-aliasing -Wall -DVERSION=\"2.4.44\" -DLOCALEDIR=\"/home/pleeke/svnroot/minimyth/gar-minimyth/images/build/usr/share/locale\" -DPACKAGE=\"attr\" -I../include -D_GNU_SOURCE -D_FILE_OFFSET_BITS=64   -c quote.c
make[7]: Leaving directory `/home/pleeke/svnroot/minimyth/gar-minimyth/script/lib/libattr/work/build.d/attr-2.4.44/include'
//home/pleeke/svnroot/minimyth/gar-minimyth/images/build/usr/bin/make -C examples
make[7]: Entering directory `/home/pleeke/svnroot/minimyth/gar-minimyth/script/lib/libattr/work/build.d/attr-2.4.44/examples'
rm -f copyattr dep dep.bak *.[1-9].gz *.tmpo *.mo       
make[7]: Leaving directory `/home/pleeke/svnroot/minimyth/gar-minimyth/script/lib/libattr/work/build.d/attr-2.4.44/examples'
/bin/sh ../libtool --mode=compile gcc -pipe -march=x86-64 -O2  -m64 -g -O2 -DDEBUG -funsigned-char -fno-strict-aliasing -Wall -DVERSION=\"2.4.44\" -DLOCALEDIR=\"/home/pleeke/svnroot/minimyth/gar-minimyth/images/build/usr/share/locale\" -DPACKAGE=\"attr\" -I./include -D_GNU_SOURCE -D_FILE_OFFSET_BITS=64  -g -O2 -DDEBUG -funsigned-char -fno-strict-aliasing -Wall -DVERSION=\"2.4.44\" -DLOCALEDIR=\"/home/pleeke/svnroot/minimyth/gar-minimyth/images/build/usr/share/locale\" -DPACKAGE=\"attr\" -I./include -D_GNU_SOURCE -D_FILE_OFFSET_BITS=64  -g -O2 -DDEBUG -funsigned-char -fno-strict-aliasing -Wall -DVERSION=\"2.4.44\" -DLOCALEDIR=\"/home/pleeke/svnroot/minimyth/gar-minimyth/images/build/usr/share/locale\" -DPACKAGE=\"attr\" -I../include -D_GNU_SOURCE -D_FILE_OFFSET_BITS=64   -c unquote.c
libtool: compile:  gcc -pipe -march=x86-64 -O2 -m64 -g -O2 -DDEBUG -funsigned-char -fno-strict-aliasing -Wall -DVERSION=\"2.4.44\" -DLOCALEDIR=\"/home/pleeke/svnroot/minimyth/gar-minimyth/images/build/usr/share/locale\" -DPACKAGE=\"attr\" -I./include -D_GNU_SOURCE -D_FILE_OFFSET_BITS=64 -g -O2 -DDEBUG -funsigned-char -fno-strict-aliasing -Wall -DVERSION=\"2.4.44\" -DLOCALEDIR=\"/home/pleeke/svnroot/minimyth/gar-minimyth/images/build/usr/share/locale\" -DPACKAGE=\"attr\" -I./include -D_GNU_SOURCE -D_FILE_OFFSET_BITS=64 -g -O2 -DDEBUG -funsigned-char -fno-strict-aliasing -Wall -DVERSION=\"2.4.44\" -DLOCALEDIR=\"/home/pleeke/svnroot/minimyth/gar-minimyth/images/build/usr/share/locale\" -DPACKAGE=\"attr\" -I../include -D_GNU_SOURCE -D_FILE_OFFSET_BITS=64 -c quote.c  -fPIC -DPIC -o .libs/quote.o
libtool: compile:  gcc -pipe -march=x86-64 -O2 -m64 -g -O2 -DDEBUG -funsigned-char -fno-strict-aliasing -Wall -DVERSION=\"2.4.44\" -DLOCALEDIR=\"/home/pleeke/svnroot/minimyth/gar-minimyth/images/build/usr/share/locale\" -DPACKAGE=\"attr\" -I./include -D_GNU_SOURCE -D_FILE_OFFSET_BITS=64 -g -O2 -DDEBUG -funsigned-char -fno-strict-aliasing -Wall -DVERSION=\"2.4.44\" -DLOCALEDIR=\"/home/pleeke/svnroot/minimyth/gar-minimyth/images/build/usr/share/locale\" -DPACKAGE=\"attr\" -I./include -D_GNU_SOURCE -D_FILE_OFFSET_BITS=64 -g -O2 -DDEBUG -funsigned-char -fno-strict-aliasing -Wall -DVERSION=\"2.4.44\" -DLOCALEDIR=\"/home/pleeke/svnroot/minimyth/gar-minimyth/images/build/usr/share/locale\" -DPACKAGE=\"attr\" -I../include -D_GNU_SOURCE -D_FILE_OFFSET_BITS=64 -c unquote.c  -fPIC -DPIC -o .libs/unquote.o
quote.c: In function 'quote':
quote.c:37:3: warning: implicit declaration of function 'strchr'
quote.c:37:21: warning: incompatible implicit declaration of built-in function 'strchr'
//home/pleeke/svnroot/minimyth/gar-minimyth/images/build/usr/bin/make -C test
make[7]: Entering directory `/home/pleeke/svnroot/minimyth/gar-minimyth/script/lib/libattr/work/build.d/attr-2.4.44/test'
make[7]: Nothing to be done for `default'.
make[7]: Leaving directory `/home/pleeke/svnroot/minimyth/gar-minimyth/script/lib/libattr/work/build.d/attr-2.4.44/test'
//home/pleeke/svnroot/minimyth/gar-minimyth/images/build/usr/bin/make -C m4
make[7]: Entering directory `/home/pleeke/svnroot/minimyth/gar-minimyth/script/lib/libattr/work/build.d/attr-2.4.44/m4'
make[7]: Nothing to be done for `default'.
make[7]: Leaving directory `/home/pleeke/svnroot/minimyth/gar-minimyth/script/lib/libattr/work/build.d/attr-2.4.44/m4'
//home/pleeke/svnroot/minimyth/gar-minimyth/images/build/usr/bin/make -C man
make[7]: Entering directory `/home/pleeke/svnroot/minimyth/gar-minimyth/script/lib/libattr/work/build.d/attr-2.4.44/man'
//home/pleeke/svnroot/minimyth/gar-minimyth/images/build/usr/bin/make -C man1
/bin/sh ../libtool --mode=compile gcc -pipe -march=x86-64 -O2  -m64 -g -O2 -DDEBUG -funsigned-char -fno-strict-aliasing -Wall -DVERSION=\"2.4.44\" -DLOCALEDIR=\"/home/pleeke/svnroot/minimyth/gar-minimyth/images/build/usr/share/locale\" -DPACKAGE=\"attr\" -I./include -D_GNU_SOURCE -D_FILE_OFFSET_BITS=64  -g -O2 -DDEBUG -funsigned-char -fno-strict-aliasing -Wall -DVERSION=\"2.4.44\" -DLOCALEDIR=\"/home/pleeke/svnroot/minimyth/gar-minimyth/images/build/usr/share/locale\" -DPACKAGE=\"attr\" -I./include -D_GNU_SOURCE -D_FILE_OFFSET_BITS=64  -g -O2 -DDEBUG -funsigned-char -fno-strict-aliasing -Wall -DVERSION=\"2.4.44\" -DLOCALEDIR=\"/home/pleeke/svnroot/minimyth/gar-minimyth/images/build/usr/share/locale\" -DPACKAGE=\"attr\" -I../include -D_GNU_SOURCE -D_FILE_OFFSET_BITS=64   -c high_water_alloc.c
make[8]: Entering directory `/home/pleeke/svnroot/minimyth/gar-minimyth/script/lib/libattr/work/build.d/attr-2.4.44/man/man1'
make[8]: Nothing to be done for `default'.
make[8]: Leaving directory `/home/pleeke/svnroot/minimyth/gar-minimyth/script/lib/libattr/work/build.d/attr-2.4.44/man/man1'
//home/pleeke/svnroot/minimyth/gar-minimyth/images/build/usr/bin/make -C man2
make[8]: Entering directory `/home/pleeke/svnroot/minimyth/gar-minimyth/script/lib/libattr/work/build.d/attr-2.4.44/man/man2'
make[8]: Nothing to be done for `default'.
make[8]: Leaving directory `/home/pleeke/svnroot/minimyth/gar-minimyth/script/lib/libattr/work/build.d/attr-2.4.44/man/man2'
//home/pleeke/svnroot/minimyth/gar-minimyth/images/build/usr/bin/make -C man3
make[8]: Entering directory `/home/pleeke/svnroot/minimyth/gar-minimyth/script/lib/libattr/work/build.d/attr-2.4.44/man/man3'
make[8]: Nothing to be done for `default'.
make[8]: Leaving directory `/home/pleeke/svnroot/minimyth/gar-minimyth/script/lib/libattr/work/build.d/attr-2.4.44/man/man3'
//home/pleeke/svnroot/minimyth/gar-minimyth/images/build/usr/bin/make -C man5
make[8]: Entering directory `/home/pleeke/svnroot/minimyth/gar-minimyth/script/lib/libattr/work/build.d/attr-2.4.44/man/man5'
make[8]: Nothing to be done for `default'.
make[8]: Leaving directory `/home/pleeke/svnroot/minimyth/gar-minimyth/script/lib/libattr/work/build.d/attr-2.4.44/man/man5'
make[7]: Leaving directory `/home/pleeke/svnroot/minimyth/gar-minimyth/script/lib/libattr/work/build.d/attr-2.4.44/man'
/bin/sh ../libtool --mode=compile gcc -pipe -march=x86-64 -O2  -m64 -g -O2 -DDEBUG -funsigned-char -fno-strict-aliasing -Wall -DVERSION=\"2.4.44\" -DLOCALEDIR=\"/home/pleeke/svnroot/minimyth/gar-minimyth/images/build/usr/share/locale\" -DPACKAGE=\"attr\" -I./include -D_GNU_SOURCE -D_FILE_OFFSET_BITS=64  -g -O2 -DDEBUG -funsigned-char -fno-strict-aliasing -Wall -DVERSION=\"2.4.44\" -DLOCALEDIR=\"/home/pleeke/svnroot/minimyth/gar-minimyth/images/build/usr/share/locale\" -DPACKAGE=\"attr\" -I./include -D_GNU_SOURCE -D_FILE_OFFSET_BITS=64  -g -O2 -DDEBUG -funsigned-char -fno-strict-aliasing -Wall -DVERSION=\"2.4.44\" -DLOCALEDIR=\"/home/pleeke/svnroot/minimyth/gar-minimyth/images/build/usr/share/locale\" -DPACKAGE=\"attr\" -I../include -D_GNU_SOURCE -D_FILE_OFFSET_BITS=64   -c next_line.c
libtool: compile:  gcc -pipe -march=x86-64 -O2 -m64 -g -O2 -DDEBUG -funsigned-char -fno-strict-aliasing -Wall -DVERSION=\"2.4.44\" -DLOCALEDIR=\"/home/pleeke/svnroot/minimyth/gar-minimyth/images/build/usr/share/locale\" -DPACKAGE=\"attr\" -I./include -D_GNU_SOURCE -D_FILE_OFFSET_BITS=64 -g -O2 -DDEBUG -funsigned-char -fno-strict-aliasing -Wall -DVERSION=\"2.4.44\" -DLOCALEDIR=\"/home/pleeke/svnroot/minimyth/gar-minimyth/images/build/usr/share/locale\" -DPACKAGE=\"attr\" -I./include -D_GNU_SOURCE -D_FILE_OFFSET_BITS=64 -g -O2 -DDEBUG -funsigned-char -fno-strict-aliasing -Wall -DVERSION=\"2.4.44\" -DLOCALEDIR=\"/home/pleeke/svnroot/minimyth/gar-minimyth/images/build/usr/share/locale\" -DPACKAGE=\"attr\" -I../include -D_GNU_SOURCE -D_FILE_OFFSET_BITS=64 -c high_water_alloc.c  -fPIC -DPIC -o .libs/high_water_alloc.o
/bin/sh ../libtool --mode=compile gcc -pipe -march=x86-64 -O2  -m64 -g -O2 -DDEBUG -funsigned-char -fno-strict-aliasing -Wall -DVERSION=\"2.4.44\" -DLOCALEDIR=\"/home/pleeke/svnroot/minimyth/gar-minimyth/images/build/usr/share/locale\" -DPACKAGE=\"attr\" -I./include -D_GNU_SOURCE -D_FILE_OFFSET_BITS=64  -g -O2 -DDEBUG -funsigned-char -fno-strict-aliasing -Wall -DVERSION=\"2.4.44\" -DLOCALEDIR=\"/home/pleeke/svnroot/minimyth/gar-minimyth/images/build/usr/share/locale\" -DPACKAGE=\"attr\" -I./include -D_GNU_SOURCE -D_FILE_OFFSET_BITS=64  -g -O2 -DDEBUG -funsigned-char -fno-strict-aliasing -Wall -DVERSION=\"2.4.44\" -DLOCALEDIR=\"/home/pleeke/svnroot/minimyth/gar-minimyth/images/build/usr/share/locale\" -DPACKAGE=\"attr\" -I../include -D_GNU_SOURCE -D_FILE_OFFSET_BITS=64   -c walk_tree.c
libtool: compile:  gcc -pipe -march=x86-64 -O2 -m64 -g -O2 -DDEBUG -funsigned-char -fno-strict-aliasing -Wall -DVERSION=\"2.4.44\" -DLOCALEDIR=\"/home/pleeke/svnroot/minimyth/gar-minimyth/images/build/usr/share/locale\" -DPACKAGE=\"attr\" -I./include -D_GNU_SOURCE -D_FILE_OFFSET_BITS=64 -g -O2 -DDEBUG -funsigned-char -fno-strict-aliasing -Wall -DVERSION=\"2.4.44\" -DLOCALEDIR=\"/home/pleeke/svnroot/minimyth/gar-minimyth/images/build/usr/share/locale\" -DPACKAGE=\"attr\" -I./include -D_GNU_SOURCE -D_FILE_OFFSET_BITS=64 -g -O2 -DDEBUG -funsigned-char -fno-strict-aliasing -Wall -DVERSION=\"2.4.44\" -DLOCALEDIR=\"/home/pleeke/svnroot/minimyth/gar-minimyth/images/build/usr/share/locale\" -DPACKAGE=\"attr\" -I../include -D_GNU_SOURCE -D_FILE_OFFSET_BITS=64 -c next_line.c  -fPIC -DPIC -o .libs/next_line.o
libtool: compile:  gcc -pipe -march=x86-64 -O2 -m64 -g -O2 -DDEBUG -funsigned-char -fno-strict-aliasing -Wall -DVERSION=\"2.4.44\" -DLOCALEDIR=\"/home/pleeke/svnroot/minimyth/gar-minimyth/images/build/usr/share/locale\" -DPACKAGE=\"attr\" -I./include -D_GNU_SOURCE -D_FILE_OFFSET_BITS=64 -g -O2 -DDEBUG -funsigned-char -fno-strict-aliasing -Wall -DVERSION=\"2.4.44\" -DLOCALEDIR=\"/home/pleeke/svnroot/minimyth/gar-minimyth/images/build/usr/share/locale\" -DPACKAGE=\"attr\" -I./include -D_GNU_SOURCE -D_FILE_OFFSET_BITS=64 -g -O2 -DDEBUG -funsigned-char -fno-strict-aliasing -Wall -DVERSION=\"2.4.44\" -DLOCALEDIR=\"/home/pleeke/svnroot/minimyth/gar-minimyth/images/build/usr/share/locale\" -DPACKAGE=\"attr\" -I../include -D_GNU_SOURCE -D_FILE_OFFSET_BITS=64 -c walk_tree.c  -fPIC -DPIC -o .libs/walk_tree.o
//home/pleeke/svnroot/minimyth/gar-minimyth/images/build/usr/bin/make -C doc
make[7]: Entering directory `/home/pleeke/svnroot/minimyth/gar-minimyth/script/lib/libattr/work/build.d/attr-2.4.44/doc'
/bin/gzip --best -c < CHANGES > CHANGES.gz
walk_tree.c: In function 'walk_tree_rec':
walk_tree.c:103:5: warning: suggest parentheses around '&&' within '||'
make[7]: Leaving directory `/home/pleeke/svnroot/minimyth/gar-minimyth/script/lib/libattr/work/build.d/attr-2.4.44/doc'
//home/pleeke/svnroot/minimyth/gar-minimyth/images/build/usr/bin/make -C po
make[7]: Entering directory `/home/pleeke/svnroot/minimyth/gar-minimyth/script/lib/libattr/work/build.d/attr-2.4.44/po'
o cs.mo cs.po
make[7]: o: Command not found
make[7]: [cs.mo] Error 127 (ignored)
o de.mo de.po
make[7]: o: Command not found
make[7]: [de.mo] Error 127 (ignored)
o es.mo es.po
make[7]: o: Command not found
make[7]: [es.mo] Error 127 (ignored)
o fr.mo fr.po
make[7]: o: Command not found
make[7]: [fr.mo] Error 127 (ignored)
o gl.mo gl.po
make[7]: o: Command not found
make[7]: [gl.mo] Error 127 (ignored)
o nl.mo nl.po
make[7]: o: Command not found
make[7]: [nl.mo] Error 127 (ignored)
o pl.mo pl.po
make[7]: o: Command not found
make[7]: [pl.mo] Error 127 (ignored)
o sv.mo sv.po
make[7]: o: Command not found
make[7]: [sv.mo] Error 127 (ignored)
make[7]: Leaving directory `/home/pleeke/svnroot/minimyth/gar-minimyth/script/lib/libattr/work/build.d/attr-2.4.44/po'
//home/pleeke/svnroot/minimyth/gar-minimyth/images/build/usr/bin/make -C debian
make[7]: Entering directory `/home/pleeke/svnroot/minimyth/gar-minimyth/script/lib/libattr/work/build.d/attr-2.4.44/debian'
make[7]: Nothing to be done for `default'.
make[7]: Leaving directory `/home/pleeke/svnroot/minimyth/gar-minimyth/script/lib/libattr/work/build.d/attr-2.4.44/debian'
//home/pleeke/svnroot/minimyth/gar-minimyth/images/build/usr/bin/make -C build
make[7]: Entering directory `/home/pleeke/svnroot/minimyth/gar-minimyth/script/lib/libattr/work/build.d/attr-2.4.44/build'
make[7]: Nothing to be done for `default'.
make[7]: Leaving directory `/home/pleeke/svnroot/minimyth/gar-minimyth/script/lib/libattr/work/build.d/attr-2.4.44/build'
//home/pleeke/svnroot/minimyth/gar-minimyth/images/build/usr/bin/make -C libattr
make[7]: Entering directory `/home/pleeke/svnroot/minimyth/gar-minimyth/script/lib/libattr/work/build.d/attr-2.4.44/libattr'
/bin/sh ../libtool --mode=compile gcc -pipe -march=x86-64 -O2  -m64 -g -O2 -DDEBUG -funsigned-char -fno-strict-aliasing -Wall -DVERSION=\"2.4.44\" -DLOCALEDIR=\"/home/pleeke/svnroot/minimyth/gar-minimyth/images/build/usr/share/locale\" -DPACKAGE=\"attr\" -I./include -D_GNU_SOURCE -D_FILE_OFFSET_BITS=64  -g -O2 -DDEBUG -funsigned-char -fno-strict-aliasing -Wall -DVERSION=\"2.4.44\" -DLOCALEDIR=\"/home/pleeke/svnroot/minimyth/gar-minimyth/images/build/usr/share/locale\" -DPACKAGE=\"attr\" -I./include -D_GNU_SOURCE -D_FILE_OFFSET_BITS=64  -g -O2 -DDEBUG -funsigned-char -fno-strict-aliasing -Wall -DVERSION=\"2.4.44\" -DLOCALEDIR=\"/home/pleeke/svnroot/minimyth/gar-minimyth/images/build/usr/share/locale\" -DPACKAGE=\"attr\" -I../include -D_GNU_SOURCE -D_FILE_OFFSET_BITS=64 -include libattr.h  -c libattr.c
/bin/sh ../libtool --mode=link gcc  -o libmisc.la quote.lo unquote.lo high_water_alloc.lo next_line.lo walk_tree.lo 
eval: 1: libtool_args+=: not found
eval: 1: compile_command+=: not found
eval: 1: finalize_command+=: not found
eval: 1: libtool_args+=: not found
eval: 1: compile_command+=: not found
eval: 1: finalize_command+=: not found
eval: 1: libtool_args+=: not found
eval: 1: libobjs+=: not found
eval: 1: non_pic_objects+=: not found
eval: 1: compile_command+=: not found
eval: 1: finalize_command+=: not found
eval: 1: libtool_args+=: not found
eval: 1: libobjs+=: not found
eval: 1: non_pic_objects+=: not found
eval: 1: compile_command+=: not found
eval: 1: finalize_command+=: not found
eval: 1: libtool_args+=: not found
eval: 1: libobjs+=: not found
eval: 1: non_pic_objects+=: not found
eval: 1: compile_command+=: not found
eval: 1: finalize_command+=: not found
eval: 1: libtool_args+=: not found
eval: 1: libobjs+=: not found
eval: 1: non_pic_objects+=: not found
eval: 1: compile_command+=: not found
eval: 1: finalize_command+=: not found
eval: 1: libtool_args+=: not found
eval: 1: libobjs+=: not found
eval: 1: non_pic_objects+=: not found
eval: 1: compile_command+=: not found
eval: 1: finalize_command+=: not found
libtool: compile:  gcc -pipe -march=x86-64 -O2 -m64 -g -O2 -DDEBUG -funsigned-char -fno-strict-aliasing -Wall -DVERSION=\"2.4.44\" -DLOCALEDIR=\"/home/pleeke/svnroot/minimyth/gar-minimyth/images/build/usr/share/locale\" -DPACKAGE=\"attr\" -I./include -D_GNU_SOURCE -D_FILE_OFFSET_BITS=64 -g -O2 -DDEBUG -funsigned-char -fno-strict-aliasing -Wall -DVERSION=\"2.4.44\" -DLOCALEDIR=\"/home/pleeke/svnroot/minimyth/gar-minimyth/images/build/usr/share/locale\" -DPACKAGE=\"attr\" -I./include -D_GNU_SOURCE -D_FILE_OFFSET_BITS=64 -g -O2 -DDEBUG -funsigned-char -fno-strict-aliasing -Wall -DVERSION=\"2.4.44\" -DLOCALEDIR=\"/home/pleeke/svnroot/minimyth/gar-minimyth/images/build/usr/share/locale\" -DPACKAGE=\"attr\" -I../include -D_GNU_SOURCE -D_FILE_OFFSET_BITS=64 -include libattr.h -c libattr.c  -fPIC -DPIC -o .libs/libattr.o
libtool: link: ar cru .libs/libmisc.a 
libtool: link: ranlib .libs/libmisc.a
libtool: link: ( cd ".libs" && rm -f "libmisc.la" && ln -s "../libmisc.la" "libmisc.la" )
make[7]: Leaving directory `/home/pleeke/svnroot/minimyth/gar-minimyth/script/lib/libattr/work/build.d/attr-2.4.44/libmisc'
/bin/sh ../libtool --mode=compile gcc -pipe -march=x86-64 -O2  -m64 -g -O2 -DDEBUG -funsigned-char -fno-strict-aliasing -Wall -DVERSION=\"2.4.44\" -DLOCALEDIR=\"/home/pleeke/svnroot/minimyth/gar-minimyth/images/build/usr/share/locale\" -DPACKAGE=\"attr\" -I./include -D_GNU_SOURCE -D_FILE_OFFSET_BITS=64  -g -O2 -DDEBUG -funsigned-char -fno-strict-aliasing -Wall -DVERSION=\"2.4.44\" -DLOCALEDIR=\"/home/pleeke/svnroot/minimyth/gar-minimyth/images/build/usr/share/locale\" -DPACKAGE=\"attr\" -I./include -D_GNU_SOURCE -D_FILE_OFFSET_BITS=64  -g -O2 -DDEBUG -funsigned-char -fno-strict-aliasing -Wall -DVERSION=\"2.4.44\" -DLOCALEDIR=\"/home/pleeke/svnroot/minimyth/gar-minimyth/images/build/usr/share/locale\" -DPACKAGE=\"attr\" -I../include -D_GNU_SOURCE -D_FILE_OFFSET_BITS=64 -include libattr.h  -c attr_copy_fd.c
libtool: compile:  gcc -pipe -march=x86-64 -O2 -m64 -g -O2 -DDEBUG -funsigned-char -fno-strict-aliasing -Wall -DVERSION=\"2.4.44\" -DLOCALEDIR=\"/home/pleeke/svnroot/minimyth/gar-minimyth/images/build/usr/share/locale\" -DPACKAGE=\"attr\" -I./include -D_GNU_SOURCE -D_FILE_OFFSET_BITS=64 -g -O2 -DDEBUG -funsigned-char -fno-strict-aliasing -Wall -DVERSION=\"2.4.44\" -DLOCALEDIR=\"/home/pleeke/svnroot/minimyth/gar-minimyth/images/build/usr/share/locale\" -DPACKAGE=\"attr\" -I./include -D_GNU_SOURCE -D_FILE_OFFSET_BITS=64 -g -O2 -DDEBUG -funsigned-char -fno-strict-aliasing -Wall -DVERSION=\"2.4.44\" -DLOCALEDIR=\"/home/pleeke/svnroot/minimyth/gar-minimyth/images/build/usr/share/locale\" -DPACKAGE=\"attr\" -I../include -D_GNU_SOURCE -D_FILE_OFFSET_BITS=64 -include libattr.h -c attr_copy_fd.c  -fPIC -DPIC -o .libs/attr_copy_fd.o
/bin/sh ../libtool --mode=compile gcc -pipe -march=x86-64 -O2  -m64 -g -O2 -DDEBUG -funsigned-char -fno-strict-aliasing -Wall -DVERSION=\"2.4.44\" -DLOCALEDIR=\"/home/pleeke/svnroot/minimyth/gar-minimyth/images/build/usr/share/locale\" -DPACKAGE=\"attr\" -I./include -D_GNU_SOURCE -D_FILE_OFFSET_BITS=64  -g -O2 -DDEBUG -funsigned-char -fno-strict-aliasing -Wall -DVERSION=\"2.4.44\" -DLOCALEDIR=\"/home/pleeke/svnroot/minimyth/gar-minimyth/images/build/usr/share/locale\" -DPACKAGE=\"attr\" -I./include -D_GNU_SOURCE -D_FILE_OFFSET_BITS=64  -g -O2 -DDEBUG -funsigned-char -fno-strict-aliasing -Wall -DVERSION=\"2.4.44\" -DLOCALEDIR=\"/home/pleeke/svnroot/minimyth/gar-minimyth/images/build/usr/share/locale\" -DPACKAGE=\"attr\" -I../include -D_GNU_SOURCE -D_FILE_OFFSET_BITS=64 -include libattr.h  -c attr_copy_file.c
libtool: compile:  gcc -pipe -march=x86-64 -O2 -m64 -g -O2 -DDEBUG -funsigned-char -fno-strict-aliasing -Wall -DVERSION=\"2.4.44\" -DLOCALEDIR=\"/home/pleeke/svnroot/minimyth/gar-minimyth/images/build/usr/share/locale\" -DPACKAGE=\"attr\" -I./include -D_GNU_SOURCE -D_FILE_OFFSET_BITS=64 -g -O2 -DDEBUG -funsigned-char -fno-strict-aliasing -Wall -DVERSION=\"2.4.44\" -DLOCALEDIR=\"/home/pleeke/svnroot/minimyth/gar-minimyth/images/build/usr/share/locale\" -DPACKAGE=\"attr\" -I./include -D_GNU_SOURCE -D_FILE_OFFSET_BITS=64 -g -O2 -DDEBUG -funsigned-char -fno-strict-aliasing -Wall -DVERSION=\"2.4.44\" -DLOCALEDIR=\"/home/pleeke/svnroot/minimyth/gar-minimyth/images/build/usr/share/locale\" -DPACKAGE=\"attr\" -I../include -D_GNU_SOURCE -D_FILE_OFFSET_BITS=64 -include libattr.h -c attr_copy_file.c  -fPIC -DPIC -o .libs/attr_copy_file.o
/bin/sh ../libtool --mode=compile gcc -pipe -march=x86-64 -O2  -m64 -g -O2 -DDEBUG -funsigned-char -fno-strict-aliasing -Wall -DVERSION=\"2.4.44\" -DLOCALEDIR=\"/home/pleeke/svnroot/minimyth/gar-minimyth/images/build/usr/share/locale\" -DPACKAGE=\"attr\" -I./include -D_GNU_SOURCE -D_FILE_OFFSET_BITS=64  -g -O2 -DDEBUG -funsigned-char -fno-strict-aliasing -Wall -DVERSION=\"2.4.44\" -DLOCALEDIR=\"/home/pleeke/svnroot/minimyth/gar-minimyth/images/build/usr/share/locale\" -DPACKAGE=\"attr\" -I./include -D_GNU_SOURCE -D_FILE_OFFSET_BITS=64  -g -O2 -DDEBUG -funsigned-char -fno-strict-aliasing -Wall -DVERSION=\"2.4.44\" -DLOCALEDIR=\"/home/pleeke/svnroot/minimyth/gar-minimyth/images/build/usr/share/locale\" -DPACKAGE=\"attr\" -I../include -D_GNU_SOURCE -D_FILE_OFFSET_BITS=64 -include libattr.h  -c attr_copy_check.c
libtool: compile:  gcc -pipe -march=x86-64 -O2 -m64 -g -O2 -DDEBUG -funsigned-char -fno-strict-aliasing -Wall -DVERSION=\"2.4.44\" -DLOCALEDIR=\"/home/pleeke/svnroot/minimyth/gar-minimyth/images/build/usr/share/locale\" -DPACKAGE=\"attr\" -I./include -D_GNU_SOURCE -D_FILE_OFFSET_BITS=64 -g -O2 -DDEBUG -funsigned-char -fno-strict-aliasing -Wall -DVERSION=\"2.4.44\" -DLOCALEDIR=\"/home/pleeke/svnroot/minimyth/gar-minimyth/images/build/usr/share/locale\" -DPACKAGE=\"attr\" -I./include -D_GNU_SOURCE -D_FILE_OFFSET_BITS=64 -g -O2 -DDEBUG -funsigned-char -fno-strict-aliasing -Wall -DVERSION=\"2.4.44\" -DLOCALEDIR=\"/home/pleeke/svnroot/minimyth/gar-minimyth/images/build/usr/share/locale\" -DPACKAGE=\"attr\" -I../include -D_GNU_SOURCE -D_FILE_OFFSET_BITS=64 -include libattr.h -c attr_copy_check.c  -fPIC -DPIC -o .libs/attr_copy_check.o
/bin/sh ../libtool --mode=compile gcc -pipe -march=x86-64 -O2  -m64 -g -O2 -DDEBUG -funsigned-char -fno-strict-aliasing -Wall -DVERSION=\"2.4.44\" -DLOCALEDIR=\"/home/pleeke/svnroot/minimyth/gar-minimyth/images/build/usr/share/locale\" -DPACKAGE=\"attr\" -I./include -D_GNU_SOURCE -D_FILE_OFFSET_BITS=64  -g -O2 -DDEBUG -funsigned-char -fno-strict-aliasing -Wall -DVERSION=\"2.4.44\" -DLOCALEDIR=\"/home/pleeke/svnroot/minimyth/gar-minimyth/images/build/usr/share/locale\" -DPACKAGE=\"attr\" -I./include -D_GNU_SOURCE -D_FILE_OFFSET_BITS=64  -g -O2 -DDEBUG -funsigned-char -fno-strict-aliasing -Wall -DVERSION=\"2.4.44\" -DLOCALEDIR=\"/home/pleeke/svnroot/minimyth/gar-minimyth/images/build/usr/share/locale\" -DPACKAGE=\"attr\" -I../include -D_GNU_SOURCE -D_FILE_OFFSET_BITS=64 -include libattr.h  -c attr_copy_action.c
libtool: compile:  gcc -pipe -march=x86-64 -O2 -m64 -g -O2 -DDEBUG -funsigned-char -fno-strict-aliasing -Wall -DVERSION=\"2.4.44\" -DLOCALEDIR=\"/home/pleeke/svnroot/minimyth/gar-minimyth/images/build/usr/share/locale\" -DPACKAGE=\"attr\" -I./include -D_GNU_SOURCE -D_FILE_OFFSET_BITS=64 -g -O2 -DDEBUG -funsigned-char -fno-strict-aliasing -Wall -DVERSION=\"2.4.44\" -DLOCALEDIR=\"/home/pleeke/svnroot/minimyth/gar-minimyth/images/build/usr/share/locale\" -DPACKAGE=\"attr\" -I./include -D_GNU_SOURCE -D_FILE_OFFSET_BITS=64 -g -O2 -DDEBUG -funsigned-char -fno-strict-aliasing -Wall -DVERSION=\"2.4.44\" -DLOCALEDIR=\"/home/pleeke/svnroot/minimyth/gar-minimyth/images/build/usr/share/locale\" -DPACKAGE=\"attr\" -I../include -D_GNU_SOURCE -D_FILE_OFFSET_BITS=64 -include libattr.h -c attr_copy_action.c  -fPIC -DPIC -o .libs/attr_copy_action.o
/bin/sh ../libtool --mode=compile gcc -pipe -march=x86-64 -O2  -m64 -g -O2 -DDEBUG -funsigned-char -fno-strict-aliasing -Wall -DVERSION=\"2.4.44\" -DLOCALEDIR=\"/home/pleeke/svnroot/minimyth/gar-minimyth/images/build/usr/share/locale\" -DPACKAGE=\"attr\" -I./include -D_GNU_SOURCE -D_FILE_OFFSET_BITS=64  -g -O2 -DDEBUG -funsigned-char -fno-strict-aliasing -Wall -DVERSION=\"2.4.44\" -DLOCALEDIR=\"/home/pleeke/svnroot/minimyth/gar-minimyth/images/build/usr/share/locale\" -DPACKAGE=\"attr\" -I./include -D_GNU_SOURCE -D_FILE_OFFSET_BITS=64  -g -O2 -DDEBUG -funsigned-char -fno-strict-aliasing -Wall -DVERSION=\"2.4.44\" -DLOCALEDIR=\"/home/pleeke/svnroot/minimyth/gar-minimyth/images/build/usr/share/locale\" -DPACKAGE=\"attr\" -I../include -D_GNU_SOURCE -D_FILE_OFFSET_BITS=64 -include libattr.h  -c syscalls.c
libtool: compile:  gcc -pipe -march=x86-64 -O2 -m64 -g -O2 -DDEBUG -funsigned-char -fno-strict-aliasing -Wall -DVERSION=\"2.4.44\" -DLOCALEDIR=\"/home/pleeke/svnroot/minimyth/gar-minimyth/images/build/usr/share/locale\" -DPACKAGE=\"attr\" -I./include -D_GNU_SOURCE -D_FILE_OFFSET_BITS=64 -g -O2 -DDEBUG -funsigned-char -fno-strict-aliasing -Wall -DVERSION=\"2.4.44\" -DLOCALEDIR=\"/home/pleeke/svnroot/minimyth/gar-minimyth/images/build/usr/share/locale\" -DPACKAGE=\"attr\" -I./include -D_GNU_SOURCE -D_FILE_OFFSET_BITS=64 -g -O2 -DDEBUG -funsigned-char -fno-strict-aliasing -Wall -DVERSION=\"2.4.44\" -DLOCALEDIR=\"/home/pleeke/svnroot/minimyth/gar-minimyth/images/build/usr/share/locale\" -DPACKAGE=\"attr\" -I../include -D_GNU_SOURCE -D_FILE_OFFSET_BITS=64 -include libattr.h -c syscalls.c  -fPIC -DPIC -o .libs/syscalls.o
/bin/sh ../libtool --mode=link gcc -Wl,--version-script,../exports  -rpath /home/pleeke/svnroot/minimyth/gar-minimyth/images/build/usr/lib -version-info 2:0:1 -o libattr.la libattr.lo attr_copy_fd.lo attr_copy_file.lo attr_copy_check.lo attr_copy_action.lo syscalls.lo 
eval: 1: libtool_args+=: not found
eval: 1: compile_command+=: not found
eval: 1: finalize_command+=: not found
eval: 1: libtool_args+=: not found
eval: 1: libtool_args+=: not found
eval: 1: libtool_args+=: not found
eval: 1: libtool_args+=: not found
eval: 1: libtool_args+=: not found
eval: 1: compile_command+=: not found
eval: 1: finalize_command+=: not found
eval: 1: libtool_args+=: not found
eval: 1: compile_command+=: not found
eval: 1: finalize_command+=: not found
eval: 1: libtool_args+=: not found
eval: 1: libobjs+=: not found
eval: 1: non_pic_objects+=: not found
eval: 1: compile_command+=: not found
eval: 1: finalize_command+=: not found
eval: 1: libtool_args+=: not found
eval: 1: libobjs+=: not found
eval: 1: non_pic_objects+=: not found
eval: 1: compile_command+=: not found
eval: 1: finalize_command+=: not found
eval: 1: libtool_args+=: not found
eval: 1: libobjs+=: not found
eval: 1: non_pic_objects+=: not found
eval: 1: compile_command+=: not found
eval: 1: finalize_command+=: not found
eval: 1: libtool_args+=: not found
eval: 1: libobjs+=: not found
eval: 1: non_pic_objects+=: not found
eval: 1: compile_command+=: not found
eval: 1: finalize_command+=: not found
eval: 1: libtool_args+=: not found
eval: 1: libobjs+=: not found
eval: 1: non_pic_objects+=: not found
eval: 1: compile_command+=: not found
eval: 1: finalize_command+=: not found
eval: 1: libtool_args+=: not found
eval: 1: libobjs+=: not found
eval: 1: non_pic_objects+=: not found
eval: 1: compile_command+=: not found
eval: 1: finalize_command+=: not found
libtool: link: gcc -shared  -fPIC -DPIC    -Wl,--version-script -Wl,../exports   -Wl,-soname -Wl,libattr.so.1 -o .libs/libattr.so.1.1.0
libtool: link: (cd ".libs" && rm -f "libattr.so.1" && ln -s "libattr.so.1.1.0" "libattr.so.1")
libtool: link: (cd ".libs" && rm -f "libattr.so" && ln -s "libattr.so.1.1.0" "libattr.so")
libtool: link: ( cd ".libs" && rm -f "libattr.la" && ln -s "../libattr.la" "libattr.la" )
make[7]: Leaving directory `/home/pleeke/svnroot/minimyth/gar-minimyth/script/lib/libattr/work/build.d/attr-2.4.44/libattr'
//home/pleeke/svnroot/minimyth/gar-minimyth/images/build/usr/bin/make -C attr
//home/pleeke/svnroot/minimyth/gar-minimyth/images/build/usr/bin/make -C getfattr
make[7]: Entering directory `/home/pleeke/svnroot/minimyth/gar-minimyth/script/lib/libattr/work/build.d/attr-2.4.44/getfattr'
make[7]: Entering directory `/home/pleeke/svnroot/minimyth/gar-minimyth/script/lib/libattr/work/build.d/attr-2.4.44/attr'
gcc -pipe -march=x86-64 -O2  -m64 -g -O2 -DDEBUG -funsigned-char -fno-strict-aliasing -Wall -DVERSION=\"2.4.44\" -DLOCALEDIR=\"/home/pleeke/svnroot/minimyth/gar-minimyth/images/build/usr/share/locale\" -DPACKAGE=\"attr\" -I./include -D_GNU_SOURCE -D_FILE_OFFSET_BITS=64  -g -O2 -DDEBUG -funsigned-char -fno-strict-aliasing -Wall -DVERSION=\"2.4.44\" -DLOCALEDIR=\"/home/pleeke/svnroot/minimyth/gar-minimyth/images/build/usr/share/locale\" -DPACKAGE=\"attr\" -I./include -D_GNU_SOURCE -D_FILE_OFFSET_BITS=64  -g -O2 -DDEBUG -funsigned-char -fno-strict-aliasing -Wall -DVERSION=\"2.4.44\" -DLOCALEDIR=\"/home/pleeke/svnroot/minimyth/gar-minimyth/images/build/usr/share/locale\" -DPACKAGE=\"attr\" -I../include -D_GNU_SOURCE -D_FILE_OFFSET_BITS=64    -c -o getfattr.o getfattr.c
gcc -pipe -march=x86-64 -O2  -m64 -g -O2 -DDEBUG -funsigned-char -fno-strict-aliasing -Wall -DVERSION=\"2.4.44\" -DLOCALEDIR=\"/home/pleeke/svnroot/minimyth/gar-minimyth/images/build/usr/share/locale\" -DPACKAGE=\"attr\" -I./include -D_GNU_SOURCE -D_FILE_OFFSET_BITS=64  -g -O2 -DDEBUG -funsigned-char -fno-strict-aliasing -Wall -DVERSION=\"2.4.44\" -DLOCALEDIR=\"/home/pleeke/svnroot/minimyth/gar-minimyth/images/build/usr/share/locale\" -DPACKAGE=\"attr\" -I./include -D_GNU_SOURCE -D_FILE_OFFSET_BITS=64  -g -O2 -DDEBUG -funsigned-char -fno-strict-aliasing -Wall -DVERSION=\"2.4.44\" -DLOCALEDIR=\"/home/pleeke/svnroot/minimyth/gar-minimyth/images/build/usr/share/locale\" -DPACKAGE=\"attr\" -I../include -D_GNU_SOURCE -D_FILE_OFFSET_BITS=64    -c -o attr.o attr.c
/bin/sh ../libtool --mode=link gcc -o attr         attr.o   ../libattr/libattr.la  
eval: 1: libtool_args+=: not found
eval: 1: compile_command+=: not found
eval: 1: finalize_command+=: not found
eval: 1: libtool_args+=: not found
eval: 1: compile_command+=: not found
eval: 1: finalize_command+=: not found
eval: 1: libtool_args+=: not found
eval: 1: compile_command+=: not found
eval: 1: finalize_command+=: not found
eval: 1: libtool_args+=: not found
libtool: link: gcc  ../libattr/.libs/libattr.so
/bin/sh ../libtool --mode=link gcc -o getfattr         getfattr.o   ../libmisc/libmisc.la ../libattr/libattr.la  
/usr/lib64/crt1.o: In function `_start':
(.text+0x20): undefined reference to `main'
collect2: ld returned 1 exit status
make[7]: *** [attr] Error 1
make[7]: Leaving directory `/home/pleeke/svnroot/minimyth/gar-minimyth/script/lib/libattr/work/build.d/attr-2.4.44/attr'
make[6]: *** [attr] Error 2
make[6]: *** Waiting for unfinished jobs....
eval: 1: libtool_args+=: not found
eval: 1: compile_command+=: not found
eval: 1: finalize_command+=: not found
eval: 1: libtool_args+=: not found
eval: 1: compile_command+=: not found
eval: 1: finalize_command+=: not found
eval: 1: libtool_args+=: not found
eval: 1: compile_command+=: not found
eval: 1: finalize_command+=: not found
eval: 1: libtool_args+=: not found
eval: 1: libtool_args+=: not found
libtool: link: gcc  ../libmisc/.libs/libmisc.a ../libattr/.libs/libattr.so
/usr/lib64/crt1.o: In function `_start':
(.text+0x20): undefined reference to `main'
collect2: ld returned 1 exit status
make[7]: *** [getfattr] Error 1
make[7]: Leaving directory `/home/pleeke/svnroot/minimyth/gar-minimyth/script/lib/libattr/work/build.d/attr-2.4.44/getfattr'
make[6]: *** [getfattr] Error 2
make[6]: Leaving directory `/home/pleeke/svnroot/minimyth/gar-minimyth/script/lib/libattr/work/build.d/attr-2.4.44'
make[5]: *** [default] Error 2
make[5]: Leaving directory `/home/pleeke/svnroot/minimyth/gar-minimyth/script/lib/libattr/work/build.d/attr-2.4.44'
make[4]: *** [build-work/build.d/attr-2.4.44/Makefile] Error 2
make[4]: Leaving directory `/home/pleeke/svnroot/minimyth/gar-minimyth/script/lib/libattr'
make[3]: *** [../../lib/libattr/cookies/build.d/install] Error 2
make[3]: Leaving directory `/home/pleeke/svnroot/minimyth/gar-minimyth/script/utils/squashfs'
make[2]: *** [imgdep-build] Error 2
make[2]: Leaving directory `/home/pleeke/svnroot/minimyth/gar-minimyth/script/utils/squashfs'
make[1]: *** [../../utils/squashfs/cookies/build.d/install] Error 2
make[1]: Leaving directory `/home/pleeke/svnroot/minimyth/gar-minimyth/script/meta/minimyth'
make: *** [imgdep-build] Error 2
pleeke@f8-mythtv:~/svnroot/minimyth/gar-minimyth/script/meta/minimyth$ 
I'm trying to build on a 64bit server (not sure if it builds ok a 32bit server), and am building pentim-mmx version of MM. Rev6948 built fine on the same server.


Any ideas?

Thanks
Peter
Pablo
Site Admin
Posts: 4182
Joined: Tue Dec 14, 2004 2:13 am
Location: La Jolla
Contact:

Re: MM rev 7028 build fails

Post by Pablo »

Could you give rev 7030 a try?

It appears that lib/libattr (as well as lib/libacl) hardcoded the shell to /bin/sh in the respective Makefiles. Then they run libtool using this hardcoded shell. Unfortunately, libtool was not generated using this hardcoded shell. This can cause a problem when the shell used to generate libtool is more feature rich than the hardcoded shell. For instance, if the shell used to generate libtool is bash but /bin/sh is a symbolic link to dash.
MiniMyth running on an Acer ApireRevo 3610 and a Zotac ZBOX-ID80-U. Find out more at my MythTV page.
pleeke
Contributor
Posts: 203
Joined: Thu Jun 30, 2005 10:25 pm

Re: MM rev 7028 build fails

Post by pleeke »

Will do. Ubuntu here, so you're right about the /bin/sh being a simlink to dash
pleeke
Contributor
Posts: 203
Joined: Thu Jun 30, 2005 10:25 pm

Re: MM rev 7028 build fails

Post by pleeke »

Pablo,

I restarted the whole build (and updated to rev7036) and now get this error;

Code: Select all

==> Running checksum on autoconf-2.65.tar.bz2
a6de1cc6434cd64038b0a0ae4e252b33  download/autoconf-2.65.tar.bz2
file autoconf-2.65.tar.bz2 passes checksum test!
	[checksum] complete for autoconf.
install -d work/build.d
 ==> Extracting download/autoconf-2.65.tar.bz2
	[extract] complete for autoconf.
	[patch] complete for autoconf.
make[9]: Entering directory `/home/pleeke/svnroot/minimyth/gar-minimyth/script/devel/autoconf-2.65'
make[9]: `../../perl/perl/cookies/build.d/install' is up to date.
make[9]: `../../devel/build-system-bins/cookies/build.d/install' is up to date.
make[9]: Leaving directory `/home/pleeke/svnroot/minimyth/gar-minimyth/script/devel/autoconf-2.65'
 ==> Running configure in work/build.d/autoconf-2.65
checking for a BSD-compatible install... //home/pleeke/svnroot/minimyth/gar-minimyth/images/build/usr/bin/install -c
checking whether build environment is sane... yes
checking for a thread-safe mkdir -p... //home/pleeke/svnroot/minimyth/gar-minimyth/images/build/usr/bin/mkdir -p
checking for gawk... gawk
checking whether make sets $(MAKE)... yes
checking whether /bin/sh -n is known to work... no
checking for characters that cannot appear in file names... none
checking whether directories can have trailing spaces... yes
checking for expr... //home/pleeke/svnroot/minimyth/gar-minimyth/images/build/usr/bin/expr
checking for GNU M4 that supports accurate traces... configure: error: no acceptable m4 could be found in $PATH.
GNU M4 1.4.6 or later is required; 1.4.13 is recommended
make[8]: *** [configure-work/build.d/autoconf-2.65/configure] Error 1
make[8]: Leaving directory `/home/pleeke/svnroot/minimyth/gar-minimyth/script/devel/autoconf-2.65'
Googling around I found this;
http://www.mail-archive.com/autoconf-pa ... 04791.html
which sounds likely related (to me anyway ;-) ) but I couldn't get it to work properly...
Pablo
Site Admin
Posts: 4182
Joined: Tue Dec 14, 2004 2:13 am
Location: La Jolla
Contact:

Re: MM rev 7028 build fails

Post by Pablo »

Arg.

I have replaced the /bin/sh link on my system with a link to dash 0.5.6.1 (compiled from scratch as I could not find a RHEL/CentOS 5 package for it). Doing this, I am able to reproduce (and fix by applying the patch from your link and running autoreconf) your problem with building devel/autoconf-2.65. Once I have done a complete rebuild so that I can fix any other problems that might be lurking when /bin/sh is /bin/dash, I will commit the fixes and let you know.
MiniMyth running on an Acer ApireRevo 3610 and a Zotac ZBOX-ID80-U. Find out more at my MythTV page.
pleeke
Contributor
Posts: 203
Joined: Thu Jun 30, 2005 10:25 pm

Re: MM rev 7028 build fails

Post by pleeke »

Many thanks! Excellent as always :D
Pablo
Site Admin
Posts: 4182
Joined: Tue Dec 14, 2004 2:13 am
Location: La Jolla
Contact:

Re: MM rev 7028 build fails

Post by Pablo »

I have committed some build system changes that enable MiniMyth to build on my system when I replace my system shell (/bin/sh) with a symbolic link to dash. Could you let me know whether or not it works on your system?
MiniMyth running on an Acer ApireRevo 3610 and a Zotac ZBOX-ID80-U. Find out more at my MythTV page.
Pablo
Site Admin
Posts: 4182
Joined: Tue Dec 14, 2004 2:13 am
Location: La Jolla
Contact:

Re: MM rev 7028 build fails

Post by Pablo »

Actually, hold off for now. I found some additional problems related to dash that prevent certain software from running even though it compiles.
MiniMyth running on an Acer ApireRevo 3610 and a Zotac ZBOX-ID80-U. Find out more at my MythTV page.
pleeke
Contributor
Posts: 203
Joined: Thu Jun 30, 2005 10:25 pm

Re: MM rev 7028 build fails

Post by pleeke »

Ok, was just going to tell you that 7040 compiled fine (but I haven't tried running it yet so I'll hold off as suggested)

Thanks
Peter
Pablo
Site Admin
Posts: 4182
Joined: Tue Dec 14, 2004 2:13 am
Location: La Jolla
Contact:

Re: MM rev 7028 build fails

Post by Pablo »

Hopefully, everything is fixed now (rev 7062). If you still have problems, then let me know.
MiniMyth running on an Acer ApireRevo 3610 and a Zotac ZBOX-ID80-U. Find out more at my MythTV page.
pleeke
Contributor
Posts: 203
Joined: Thu Jun 30, 2005 10:25 pm

Re: MM rev 7028 build fails

Post by pleeke »

Pablo,

Sorry for the delay. I'm now building rev 7094, 0.23 build, x86-64. It builds fine, but fails to boot up (i'm working on this remotely, but I don't see mythfrontend ever appear in the running process list). This is what I see in the /var/log/messages

Code: Select all

Sep  8 10:20:34 intel local0.info minimyth: Processing DHCP override variables ...
Sep  8 10:20:34 intel local0.info minimyth: configuring network interface ...
Sep  8 10:20:34 intel local0.info minimyth: running DHCP client command '/sbin/udhcpc -S -o -O subnet -O router -O dns -O logsrv -O hostname -O domain -O broadcast -O ntpsrv -O tcode -p /var/run/udhcpc.pid -s /etc/udhcpc.script -i eth0 -r 192.168.0.20 > /var/log/udhcp
Sep  8 10:20:34 intel daemon.info udhcpc[503]: udhcpc (v1.17.2) started
Sep  8 10:20:34 intel daemon.info udhcpc[503]: Sending discover...
Sep  8 10:20:34 intel daemon.info udhcpc[503]: Sending select for 192.168.0.20...
Sep  8 10:20:34 intel daemon.info udhcpc[503]: Lease of 192.168.0.20 obtained, lease time 21600
Sep  8 10:20:34 intel local0.info minimyth: Fetching firmware files ...
Sep  8 10:20:34 intel local0.info minimyth: loading kernel modules (automatic) ...
Sep  8 10:20:34 intel daemon.err udevd-work[749]: kernel-provided name 'sr0' and NAME= 'dvd-sr0' disagree, please use SYMLINK+= or change the kernel to provide the proper name
Sep  8 10:20:37 intel local0.info minimyth: loading kernel modules (manual) ...
Sep  8 10:20:37 intel local0.info minimyth: processing configuration file ...
Sep  8 10:20:37 intel local0.info minimyth: fetching 'confro:/lircrc.mythtv': local file will be '/etc/lirc/lircrc.d/mythtv'.
Sep  8 10:20:37 intel local0.info minimyth: fetching 'confro:/lircrc.mythtv': URL 'http://192.168.0.10/minimyth/gpxe.cfg/conf/intel.home/lircrc.mythtv' fetched.
Sep  8 10:20:37 intel local0.info minimyth: fetched MiniMyth read-only configuration file '/lircrc.mythtv'
Sep  8 10:20:37 intel local0.info minimyth:   by fetching 'http://192.168.0.10/minimyth/gpxe.cfg/conf/intel.home/lircrc.mythtv'
Sep  8 10:20:37 intel local0.info minimyth:   to local file '/etc/lirc/lircrc.d/mythtv'.
Sep  8 10:20:38 intel local0.info minimyth: fetching 'confro:/DejaVuSans.ttf': local file will be '/usr/share/fonts/X11/TTF/DejaVuSans.ttf'.
Sep  8 10:20:38 intel local0.info minimyth: fetching 'confro:/DejaVuSans.ttf': URL 'http://192.168.0.10/minimyth/gpxe.cfg/conf/intel.home/DejaVuSans.ttf' fetched.
Sep  8 10:20:38 intel local0.info minimyth: fetched MiniMyth read-only configuration file '/DejaVuSans.ttf'
Sep  8 10:20:38 intel local0.info minimyth:   by fetching 'http://192.168.0.10/minimyth/gpxe.cfg/conf/intel.home/DejaVuSans.ttf'
Sep  8 10:20:38 intel local0.info minimyth:   to local file '/usr/share/fonts/X11/TTF/DejaVuSans.ttf'.
Sep  8 10:20:38 intel local0.warn minimyth: 'unknown audio device. assuming audio gain is '90'.
Sep  8 10:20:38 intel local0.warn minimyth: 'unknown audio device. assuming audio device number is '0'.
Sep  8 10:20:38 intel local0.warn minimyth: 'unknown audio card. assuming audio card number is '0'.
Sep  8 10:20:38 intel local0.info minimyth: fetching 'confro:/LCDd.conf': local file will be '/etc/LCDd.conf'.
Sep  8 10:20:38 intel local0.info minimyth: fetching 'confro:/LCDd.conf': URL 'http://192.168.0.10/minimyth/gpxe.cfg/conf/intel.home/LCDd.conf' fetched.
Sep  8 10:20:38 intel local0.info minimyth: fetched MiniMyth read-only configuration file '/LCDd.conf'
Sep  8 10:20:38 intel local0.info minimyth:   by fetching 'http://192.168.0.10/minimyth/gpxe.cfg/conf/intel.home/LCDd.conf'
Sep  8 10:20:38 intel local0.info minimyth:   to local file '/etc/LCDd.conf'.
Sep  8 10:20:38 intel local0.info minimyth: starting system logging ...
Sep  8 10:20:38 intel syslog.info syslogd exiting

I guess its the daemon.err line thats causing an issue (without being in front of the box itself).

Thanks
Peter
pleeke
Contributor
Posts: 203
Joined: Thu Jun 30, 2005 10:25 pm

Re: MM rev 7028 build fails

Post by pleeke »

Actually looking at the boot messages from a working build (rev6948) I see the same error, so doubt thats it.

Looking at the processes running it seems that rev7094 isn't running;

Code: Select all

minimyth  2302     1  0 11:09 ?        00:00:00 /usr/bin/xinit
and has no /var/log/Xorg.0.0log logfile. Seems like X is never started?
Pablo
Site Admin
Posts: 4182
Joined: Tue Dec 14, 2004 2:13 am
Location: La Jolla
Contact:

Re: MM rev 7028 build fails

Post by Pablo »

Odd.

If you use the latest stable binary version (73), then does it boot?

If you run 'xinit' on the your MiniMyth frontend while connected as user 'minimyth', then do you see any useful error messages?
MiniMyth running on an Acer ApireRevo 3610 and a Zotac ZBOX-ID80-U. Find out more at my MythTV page.
pleeke
Contributor
Posts: 203
Joined: Thu Jun 30, 2005 10:25 pm

Re: MM rev 7028 build fails

Post by pleeke »

Running xinit as the minimyth user I see;

Code: Select all

minimyth@intel:~ $ xinit

giving up.
xinit:  No such file or directory (errno 2):  unable to connect to X server
xinit:  No such process (errno 3):  Server error.
minimyth@intel:~ $ 
and in Xorg.0.0.log I see;

Code: Select all


minimyth@intel:~ $ cat /var/log/Xorg.0.0.log 

X.Org X Server 1.6.5
Release Date: 2009-10-11
X Protocol Version 11, Revision 0
Build Operating System: Linux 2.6.32-24-server x86_64 
Current Operating System: Linux intel.home 2.6.34.3 #1 SMP Tue Sep 7 18:34:47 BST 2010 x86_64
Build Date: 07 September 2010  07:05:44PM
 
        Before reporting problems, check http://wiki.x.org
        to make sure that you have the latest version.
Markers: (--) probed, (**) from config file, (==) default setting,
        (++) from command line, (!!) notice, (II) informational,
        (WW) warning, (EE) error, (NI) not implemented, (??) unknown.
(==) Log file: "/var/log/Xorg.0.0.log", Time: Thu Sep  9 08:53:26 2010
(==) Using config file: "/etc/X11/xorg.conf"
Parse error on line 2 of section Files in file /etc/X11/xorg.conf
        "@NVIDIA_TRUE@" is not a valid keyword in this section.
(EE) Problem parsing the config file
(EE) Error parsing the config file

Fatal server error:
no screens found

Please consult the The X.Org Foundation support 
         at http://wiki.x.org
 for help. 
Please also check the log file at "/var/log/Xorg.0.0.log" for additional information.

(WW) xf86CloseConsole: KDSETMODE failed: Bad file descriptor
(WW) xf86CloseConsole: VT_GETMODE failed: Bad file descriptor
minimyth@intel:~ $ 
and my xorg.conf file looks like (I use autogenerated xorg.conf);

Code: Select all


minimyth@intel:~ $ cat /etc/X11/xorg.conf 
Section "Files"
@NVIDIA_TRUE@    ModulePath  "/usr/lib/nvidia/xorg/modules"
    ModulePath  "/usr/lib/xorg/modules"
EndSection

Section "ServerFlags"
    Option      "DefaultServerLayout" "Layout1"
    Option      "BlankTime"           "0"
    Option      "StandbyTime"         "0"
    Option      "SuspendTime"         "0"
    Option      "OffTime"             "0"
    Option      "NoPM"                "true"
    Option      "Xinerama"            "false"
    Option      "AIGLX"               "false"
EndSection

Section "Monitor"
    Identifier  "Monitor1"
    DisplaySize @X_DISPLAYSIZE_X@ @X_DISPLAYSIZE_Y@
    @MM_X_SYNC@
    @MM_X_REFRESH@
    @MM_X_MODELINE@
    @MM_X_MODELINE_0@
    @MM_X_MODELINE_1@
    @MM_X_MODELINE_2@
EndSection

Section "Device"
    Identifier  "Device_intel_810"
    Driver      "intel"
    Option      "XvMCSurfaces"    "7"
    Option      "XvPreferOverlay" "true"
    Option      "TV_FORMAT" "@MM_X_TV_TYPE@"
    Option      "TV_Connector" "@MM_X_TV_OUTPUT@"

    Option      "Monitor-@MM_X_DEVICE_INTEL@" "Monitor1"
EndSection

Section "Device"
    Identifier  "Device_intel_915"
    Driver      "intel"
    Option      "XvPreferOverlay" "true"
    Option      "TV_FORMAT" "@MM_X_TV_TYPE@"
    Option      "TV_Connector" "@MM_X_TV_OUTPUT@"

    Option      "Monitor-@MM_X_DEVICE_INTEL@" "Monitor1"
EndSection

Section "Device"
    Identifier  "Device_geode"
    Driver      "geode"
EndSection

Section "Device"
    Identifier  "Device_nouveau"
    Driver      "nouveau"
EndSection

Section "Device"
    Identifier  "Device_nv"
    Driver      "nv"
EndSection

Section "Device"
    Identifier  "Device_nvidia"
    Driver      "nvidia"
    Option      "NoLogo"              "true"
    Option      "ConnectedMonitor"    "@MM_X_DEVICE_NVIDIA@"
    Option      "TVStandard"          "@MM_X_TV_TYPE@"
    Option      "TVOutFormat"         "@MM_X_TV_OUTPUT@"
    Option      "TVOverScan"          "@MM_X_TV_OVERSCAN@"
    Option      "UseEdidFreqs"        "false"
    Option      "UseEDIDDpi"          "false"
    Option      "DynamicTwinView"     "false"
    Option      "UseEvents"           "false"
    Option      "ExactModeTimingsDVI" "true"
    Option      "ModeValidation"      "NoDFPNativeResolutionCheck"
EndSection

Section "Device"
    Identifier  "Device_openchrome"
    Driver      "openchrome"
    Option      "EnableAGPDMA"        "true"
    Option      "ActiveDevice"        "@MM_X_DEVICE_VIA@"
    Option      "TVType"              "@MM_X_TV_TYPE@"
    Option      "TVOutput"            "@MM_X_TV_OUTPUT@"
    Option      "TVDeflicker"         "2"
EndSection

Section "Device"
    Identifier  "Device_radeon"
    Driver      "radeon"
EndSection

Section "Device"
    Identifier  "Device_radeonhd"
    Driver      "radeonhd"
EndSection

Section "Device"
    Identifier  "Device_savage"
    Driver      "savage"
EndSection

Section "Device"
    Identifier  "Device_sis"
    Driver      "sis"
EndSection

Section "Device"
    Identifier  "Device_vmware"
    Driver      "vmware"
EndSection

Section "Screen"
    Identifier  "Screen1"
    Device      "Device_@MM_X_DRIVER@"
    Monitor     "Monitor1"
    DefaultDepth 24

    Subsection "Display"
        Depth       24
        Virtual     @X_VIRTUAL_X@ @X_VIRTUAL_Y@
        ViewPort    0 0
        Modes       @MM_X_MODE@ @MM_X_MODE_0@ @MM_X_MODE_1@ @MM_X_MODE_2@
    EndSubsection
EndSection

Section "ServerLayout"
    Identifier  "Layout1"
    Screen      "Screen1"
EndSection

Section "DRI"
    Mode 0666
EndSection
minimyth@intel:~ $ 
So I created an xorg.conf file and fetched it during boot up using the minimyth.conf option and still X was never started. Though it did start fine (and mythfrontend/lcdserver etc) when running xinit as user minimyth from the command line, but I see these errors;

Code: Select all


minimyth@intel:~ $ xinit

xscreensaver: invalid time interval specification "@MM_X_SCREENSAVER_TIMEOUT@".
xscreensaver: selected must be an integer, not @SELECTED@.
xscreensaver: 09:12:54: locking is disabled (not compiled with locking support).

The VNC desktop is:      intel.home:0
PORT=5900

Not sure whats going on with the above, but the stable b73 version works fine (so guess its more things relating to building on Ubuntu & dash?)

Thanks
Peter
Pablo
Site Admin
Posts: 4182
Joined: Tue Dec 14, 2004 2:13 am
Location: La Jolla
Contact:

Re: MM rev 7028 build fails

Post by Pablo »

Symbols such as @NVIDIA_TRUE@ in /etc/X11/xorg.conf are an indication that MiniMyth's init did not get far enough to do its variable substitution in /etc/X11/xorg.conf. Since one of your prior /var/log/messages file ends with "syslog.info syslogd exiting", I assume that you are forwarding MiniMyth's log messages to some other server. If you look at that system's message log, it might provide more information on when (and therefore why) MiniMyth died during init.
MiniMyth running on an Acer ApireRevo 3610 and a Zotac ZBOX-ID80-U. Find out more at my MythTV page.
Post Reply